{"text_format":"1","workbook":"xlsx","n_sheets":10,"sheets":["Instructions","1. Project Details","2. Heat Loss Calculator","IR System Selection","Tube Htr Kits","X-Ref Tubes- Straight","X-Ref Tubes -\"U\"","X-Ref High Intensity","1","2"],"not_rendered":{"charts":0,"images":1,"macros":1,"external_links":4,"defined_names":62,"comments":5,"pivot_tables":0},"unopened":[],"bounds":{"document_bytes":16777216,"sheet_cells":100000,"rows_first":2000,"rows_last":500,"rows_between":2000,"halvings":0,"cell_chars":16384,"cell_head_chars":4096},"cells_cut":0,"cells_raw":0,"read":"whole","date_system":"1900"}

{"sheet":"Instructions","index":0,"n_rows":21,"n_cols":3,"rows_kept":21,"cut":false,"hidden":false,"merged":[]}
[]
[null,"InfraSave Tools"]
[]
[null,"We are providing these tools to help you select the best InfraSave product solution for your application."]
[]
[null,"Heat Loss Calculator Tool: (2 parts)","This tool helps select gas-fired radiant heaters for your customer's project. "]
[null,"1. Enter Project Details","FIRST: Go to the Project Details sheet and enter required project information as the first step in calculating Heat Loss"]
[null,"                              click here:"]
[null,"2. Calculate Heat Loss","SECOND: Go to the Heat Loss sheet (InfraCalc©) and select the proper building material"]
[null,"                              click here:","THIRD: Continue on to the Heater & Model Selection Tools below"]
[]
[null,"Heater & Model Selection Tools"]
[null,"To select an IR System, ","CONTRACTOR knows the total input of current equipment to be replaced --> the required input of radiant heaters is calculated"]
[null,"                              click here:","If the customer's fuel cost rate is known, the relative operating cost of each system can also be calculated"]
[null,"To select Tube Heater Kits:  ","Based upon the application and model selected: provides the proper Burner Kits, Tube Kits and their part numbers"]
{"$rows_left_out":7}
{"sheet":"1. Project Details","index":1,"n_rows":226,"n_cols":18,"rows_kept":226,"cut":false,"hidden":false,"merged":[[17,2,17,5],[52,2,52,3],[16,2,16,5],[5,2,5,3],[13,2,13,5],[14,2,14,5],[15,2,15,5],[53,2,53,3],[54,2,54,3],[55,2,55,3],[60,8,62,13],[40,8,40,9],[48,8,50,10],[51,8,51,9],[57,5,58,6],[56,2,56,3],[57,2,57,3]]}
[]
[]
[null,"Heat Loss Calculator - Step 1: Project Details"]
[]
[]
[null,"Project Country*","USA"]
[]
[]
[null,"PROJECT PROFILE"]
[]
[null,null,null,null,null,null,null,null,null,null,null,null,null,null,"Standard Units"]
[null,null,null,null,null,null,null,null,null,null,null,null,null,null,null,"Metric Units"]
[]
[null,"Quote / Project File # / Date",{"$f":"NOW()","v":"2015-09-08T08:45:20.630"}]
[null,"Main Project Name*   "]
{"$rows_left_out":212}
{"sheet":"2. Heat Loss Calculator","index":2,"n_rows":79,"n_cols":34,"rows_kept":79,"cut":false,"hidden":false,"merged":[[23,2,23,3],[5,14,9,14],[9,0,17,0],[16,14,16,15],[18,2,18,3],[19,2,19,3],[20,4,20,11],[21,2,21,3],[22,2,22,3],[35,2,35,3],[24,2,24,3],[29,2,29,3],[30,2,30,3],[31,4,31,11],[32,2,32,3],[33,2,33,3],[34,2,34,3],[25,4,25,11],[26,2,26,3],[27,2,27,3],[28,2,28,3],[47,2,47,3],[36,2,36,3],[37,4,37,11],[38,2,38,3],[39,2,39,3],[40,2,40,3],[41,2,41,3],[42,2,42,3],[43,4,43,11],[44,2,44,3],[45,2,45,3],[46,2,46,3],[57,2,57,3],[48,2,48,3],[50,2,50,3],[51,2,51,3],[53,2,53,3],[54,2,54,3],[56,2,56,3]]}
[]
[]
[null,null,"Heat Loss Calculator - Step 2: Calculations"]
[]
[null,null,"PROJECT DETAILS  (summary from the Project Details sheet)",null,null,null,null,null,null,null,null,{"$f":"TODAY()","v":"2015-09-08"}]
[null,null,{"$f":"'1. Project Details'!C15&\", \"&PROPER('1. Project Details'!C17)&\", \"&IF('1. Project Details'!C6=\"USA\",UPPER('1. Project Details'!C18),UPPER('1. Project Details'!C18))","v":", , "}]
[null,null,{"$f":"IF('1. Project Details'!C16=\"\",\"\",'1. Project Details'!C16)","v":""},null,null,null,null,null,null,null,null,null,null,"Hide"]
[null,null,{"$f":"IF('1. Project Details'!$C$14=\"\",\"\",'1. Project Details'!C14)","v":"2015-09-08T08:45:20.630"},null,null,null,null,null,null,null,null,null,null,"This "]
[]
[null,null,"construction/infiltration 'tightness' ",{"$f":"IF('1. Project Details'!O22=\"SCROLL to SELECT\",\"Select a value in 'Project Details' cell B9 or K10\",'1. Project Details'!O22)","v":"SELECT"},null,null,null,null,null,null,null,null,null,"column"]
[null,null,"air change/hr allowance ",{"$f":"'1. Project Details'!C27","v":0},"  x bldg volume",null,null,null,"outside temperature ",{"$f":"'1. Project Details'!C21","v":0},{"$f":"'1. Project Details'!D21","v":"°F"}]
[null,null,"building length ",{"$f":"'1. Project Details'!C23","v":0},{"$f":"'1. Project Details'!D23","v":" ft"},null,null,null,"inside temperature ",{"$f":"'1. Project Details'!C22","v":68},{"$f":"'1. Project Details'!D22","v":"°F"}]
[null,null,"building width ",{"$f":"'1. Project Details'!C24","v":0},{"$f":"'1. Project Details'!D24","v":" ft"},null,null,null,"design temp. diff. DT  ",{"$f":"IF(OR(J11=\"Not Indicated\",J12=\"\"),\"\",J12-J11)","v":68}," F°"]
[null,null,"avg. building height ",{"$f":"'1. Project Details'!O21","v":0},{"$f":"'1. Project Details'!D25","v":" ft"},null,null,null,"floor area to heat ",{"$f":"D12*D13","v":0},{"$f":"N15","v":" ft²"},null,null,"m²"]
[null,null,"heated volume not in this design ",0,{"$f":"LEFT('1. Project Details'!$D$28,3)","v":" ft"},null,null,null,"volume to condition ",{"$f":"D12*D13*D14-D15","v":0},{"$f":"E15","v":" ft"},null,null," ft²"]
{"$rows_left_out":65}
{"sheet":"IR System Selection","index":3,"n_rows":95,"n_cols":29,"rows_kept":95,"cut":false,"hidden":false,"merged":[[47,6,47,8],[48,6,48,7],[33,6,33,7],[46,6,46,7],[39,6,39,7],[40,6,40,7],[41,6,41,8],[42,6,42,7],[43,6,43,7],[45,1,45,2],[45,6,45,7],[32,6,32,7],[34,6,34,8],[35,6,35,7],[36,6,36,7],[37,6,37,7],[38,6,38,8],[10,6,10,7],[11,6,11,7],[12,6,12,7],[13,6,13,7],[14,6,14,7]]}
[]
[null,"IR System Selection"]
[]
[null,null,null,"Project Country*",{"$f":"'1. Project Details'!C6","v":"USA"},null,null,null,null,null,null,null,null,null,"USA"]
[null,null,null,null,null,null,null,null,null,null,null,null,null,null,"CANADA"]
[null,"CURRENT CONVENTIONAL HEATING SYSTEM INPUT ",null,null,null,null,null,null,{"$f":"TODAY()","v":"2015-09-08"}]
[]
[null,null,null,"Calculated Heat Loss",{"$f":"IF('2. Heat Loss Calculator'!$J$64>0,'2. Heat Loss Calculator'!$J$64,\"None\")","v":"None"},"Btuh"]
[null,null,null,"(Results from the compuSchwank II© heat loss calculator)"]
[null,null,{"$f":"IF(E8=\"None\",\"TOTAL INPUT OF HEATERS TO BE REPLACED\",\"TOTAL INPUT REQUIRED TO SATISFY HEAT LOSS\")","v":"TOTAL INPUT OF HEATERS TO BE REPLACED"}]
[null,null,null,"Current System","Input (Btuh)","Efficiency",{"$f":"IF(E24=\"?\",\"\",\"Cost / Hour   Operation\")","v":"Cost / Hour   Operation"}]
[null,null,null,"Unit Heaters",80000,0.8,{"$f":"IF(OR($E$24=\"?\",E12=0),\"\",E12/$F$23*$E$24)","v":1.0434782608695652}]
[null,null,null,"Roof Top",null,0.8,{"$f":"IF(OR($E$24=\"?\",E13=0),\"\",E13/$F$23*$E$24)","v":""}]
[null,null,null,"Boiler",null,0.8,{"$f":"IF(OR($E$24=\"?\",E14=0),\"\",E14/$F$23*$E$24)","v":""}]
[null,null,null,"Other Infrared",null,null,{"$f":"IF(OR($E$24=\"?\",E15=0),\"\",E15/$F$23*$E$24)","v":""}]
{"$rows_left_out":81}
{"sheet":"Tube Htr Kits","index":4,"n_rows":173,"n_cols":22,"rows_kept":173,"cut":false,"hidden":false,"merged":[[36,1,39,1],[17,3,17,5],[19,3,19,5],[19,7,19,8],[19,9,19,14],[18,3,18,5],[19,16,19,17],[20,3,20,5],[20,7,20,8],[20,9,20,14],[13,9,13,11],[17,7,17,8],[17,9,17,14],[17,16,17,17],[18,7,18,8],[18,9,18,14],[4,9,4,10],[9,9,9,13],[10,9,10,13],[12,9,12,11],[11,9,11,12]]}
[null,null,null,null,null,null,null,null,null,null,null,null,null,null,null,null,null,null,null,null,null,{"$f":"IF(J12=\"Btuh x Tube Length\",0,1)","v":1}]
[]
[null,"Tube Heater Kit & Accessory Selection Guide",null,null,null,null,null,null,null,null,null,null,null,null,null,null,{"$f":"LEFT(J11,FIND(\" \",J11)-1)","v":"Now"},null,"Now",null,null,{"$f":"AND(U7=40,U8=\"STW-JZ\")","v":{"$error":"#VALUE!"}}]
[null,null,null,null,null,null,null,null,null,null,null,null,null,null,null,null,null,null,null,null,"USA"]
[null,null,null,null,null,null,null,"Select your Country*",null,{"$f":"'1. Project Details'!C6","v":"USA"},null," - Selects proper gas connector",null,null,null,null,null,{"$f":"IF(ISERR(U7),U10,U7)","v":{"$error":"#VALUE!"}},null,null,"CANADA",",IF(AND(U7=\"40\",U8=\"SPW-JZ\"),\"P40U-P\""]
[]
[null,"TUBE HEATER REQUIREMENTS",null,null,null,null,null,null,null,null,null,null,null,null,null,null,null,{"$f":"TODAY()","v":"2015-09-08"},null,null,{"$f":"IF(V1=0,\"\",VALUE(LEFT(J12,FIND(\",\",J12)-1)))","v":{"$error":"#VALUE!"}}]
[null,null,null,null,null,null,null,null,null,null,null,null,null,null,null,null,null,null,null,null,{"$f":"LEFT(J11,FIND(\" \",J11)-1)","v":"Now"},{"$f":"IF(U8=\"P40R\",U8,IF(AND(U7=40,U8=\"IW\"),\"P40U-IW\",IF(AND(U7=40,U8=\"IWP\"),\"P40U-IP\",\"P40U-I\")))","v":{"$error":"#VALUE!"}}]
[]
[null,null,null,null,null,null,null,"1.  Application*",null,"Select APPLICATION Here",null,null,null,null,null,null,null,null,null,null,{"$f":"IF(FIND(\"/\",J12)=3,VALUE(LEFT(J12,2)),VALUE(LEFT(J12,3)))","v":{"$error":"#VALUE!"}}]
[null,null,null,null,null,null,null,"2.  Heater Series*",null,"Now Select Tube Heater Series Here",null,null,null,null,null,null,null,null,null,null,{"$f":"IF(U7=40,V8,LEFT(U12,LEN(U12)-3))","v":{"$error":"#VALUE!"}}]
[null,null,null,null,null,null,null,"3.  Input & Length*",null,"SELECT Btuh x Tube Length",null,null,null,null,null,null,null,null,null,null,{"$f":"IF(U7=40,V8,LEFT(J11,FIND(\" \",J11)-1)&\"-\"&VLOOKUP(J12,K67:L89,2,FALSE))","v":{"$error":"#VALUE!"}}]
[null,null,null,null,null,null,null,"4.  Quantity Required*",null,null,null,null,null,null,null,null,null,null,null,null,{"$f":"ROUNDUP(RIGHT(U12,2)/10,0)","v":{"$error":"#VALUE!"}}]
[null,null,null,null,null,null,null,"Chain length required at each hanger",null,null,null,null,{"$f":"\"ft  (a value here will calculate the required Suspension Hardware)\"","v":"ft  (a value here will calculate the required Suspension Hardware)"},null,null,null,null,null,null,null,{"$f":"IF(U7=40,V8,LEFT(U11,3))","v":{"$error":"#VALUE!"}}]
[]
{"$rows_left_out":159}
{"sheet":"X-Ref Tubes- Straight","index":5,"n_rows":186,"n_cols":28,"rows_kept":186,"cut":false,"hidden":false,"merged":[[2,13,2,14],[0,2,0,4],[2,2,2,3],[2,6,2,8],[2,9,2,10],[2,11,2,12],[2,4,2,5],[2,18,2,19],[2,20,2,21],[2,26,2,27],[185,16,185,17],[2,15,2,17]]}
[null,null,"Click here to go to Instructions"]
["TUBES - STRAIGHT COMPARISONS",null,null,null,null,null,null,null,null,null,null,null,null,null,null,null,"Vacuum systems 'suck'"]
["BTU/hr ","Tube","InfraSave",null,"Schwank",null,"Detroit Radiant (Reverberay)",null,null,"Roberts Gordon",null,"Superior Radiant",null,"Solaronics",null,"Space Ray",null,null,"Reznor",null,"Modine",null,"Sterling","Enerco","Calcana","AmbiRad","Easy Radiant"]
[null,null,"PREMIER","BUILDER","PREMIER","BUILDER",null,null,null,null,null,"Economy",null,null,null,null,"Vacuum","Vacuum"]
["Input","Length","IQ ","ITB ","STS-JZ ","S100 ","DX-2 Series","XTS Series","DES Series","Gordonray BH","Vantage II","UA / UX Series","LA / LX Series","Suntube IV","GQ Series","PTS","LTS Series","ETS","VR Series","TR Series","TLP Series","LF / HF Series","SLR Series","ERXL Series","SR Series","PT Series","EZ Series","SH Series"]
[30000,30,null,null,null,null,null,null,null,null,null,null,"LA (X)-40 30"]
[40000,10,"P40U-I","P40U-I","P40U","P40U",null,null,null,"BH40  10","CTH2-40  10","UA (X) 04  10",null,"STG40   10","GCG40   10","PTS40-10",null,null,null,null,null,"LF40  20","SLR40  10",null,"SR-40  10","PT40  10"]
[null,15,null,null,null,null,null,null,null,null,null,null,null,"STG40   15","GCG40   15",null,"LTS40-15","ETS40-15",null,null,null,"LF40  30","SLR40  15",null,"SR-40  15"]
[null,20,null,null,null,null,null,null,null,null,null,"UA (X) 04  20",null,"STG40   20","GCG40   20","PTS40-20","LTS40-20","ETS40-20",null,null,null,null,"SLR40  20",null,"SR-40  20"]
[null,30,null,null,null,null,null,null,null,null,null,null,"LA (X)-40 40"]
[null,40]
[45000,20,"IQ 45   20","ITB 45 20","STS-JZ 45   20","S100-45-20",null,null,null,null,null,null,null,"STG45   20","GCG45   20"]
[null,null,null,null,null,null,null,null,null,null,null,null,"LA (X)-60 30"]
[null,null,null,null,null,null,null,null,null,null,null,null,"LA (X)-60 40"]
[null,null,null,null,null,null,null,null,null,null,null,null,"LA (X)-60 50"]
{"$rows_left_out":172}
{"sheet":"X-Ref Tubes -\"U\"","index":6,"n_rows":115,"n_cols":18,"rows_kept":115,"cut":false,"hidden":false,"merged":[[1,12,1,13],[4,7,4,9],[4,10,4,11]]}
[]
[null,null,null,null,null,null,null,null,null,null,null,null,"Click here to go to Instructions"]
[]
["TUBES - U COMPARISONS"]
["BTU/hr ","Heater","InfraSave","Schwank","Reznor","Modine","Sterling","Space Ray",null,null,"Solaronics",null,"Detroit Radiant","Roberts Gordon","Enerco","Easy Radiant","Calca na","Ambi-Rad"]
["Input","Length","ITBU Series","S100U Series","TRP Series","NONE","NONE","LTU","ETU","PTU","Suntube IV","GQ Series","NONE","NONE","NONE","EZ-U Series","NONE","NONE"]
[30000,10,null,null,"TRP30"]
[40000,10,"P40U-I","P40U",null,null,null,null,"ETU40-20","PTS/U 40","STU40 15A","GQU40 20A"]
[null,15,null,null,null,null,null,"LTU40-30",null,null,"STU40 20A"]
[null,20,null,null,null,null,null,null,null,null,"STU40 20A"]
[45000,10,null,null,null,null,null,null,null,null,null,"GQU45 20A"]
[null,15,null,null,null,null,null,null,null,null,"STU45 20A"]
[null,20]
[50000,10,null,null,null,null,null,null,"ETU50-20","PTS/U 50",null,"GQU50 20A"]
[null,15,null,null,"TRP50",null,null,"LTU50-30","ETU50-30",null,"STU50 20A"]
{"$rows_left_out":101}
{"sheet":"X-Ref High Intensity","index":7,"n_rows":58,"n_cols":19,"rows_kept":58,"cut":false,"hidden":false,"merged":[[4,8,4,9],[3,2,3,4],[1,10,1,11],[3,8,3,9],[3,13,3,14]]}
[]
[null,null,null,null,null,null,null,null,null,null,"Click here to go to Instructions"]
["HIGH INTENSITY COMPARISONS"]
[null,null,"InfraSave",null,null,"Schwank","Solaronics","Detroit Radiant","Space-Ray",null,"Superior Radiant","Roberts Gordon","Reznor","Modine",null,"Sterling","Enerco","Easy Radiant","Sun Technology"]
["KW","BTU ","Standard Model","81% Radiant ","67% Radiant","Standard Model",null,"(Re-Verber-Ray)","     Gas Fired Products",null,null,"Gordon Glow",null,null,null,null,null,null,"Ray-Tech"]
["INPUT","INPUT","IL Series","supraSchwank (1)","primoSchwank (1)","ecoSchwank","K Series","DR Series","RSCA Series","DK Series","HD Series","GG Series","RIH Series","MT Series","GR Series","SHR Series","EnerRadiant","RA Series","RT Series"]
[{"$f":"B7/3413","v":6.2994433050102545},21500,null,null,null,"ecoSchwank 6"]
[7.3249340755933199,25000,null,null,null,null,null,null,null,null,null,"DISCONTINUED",null,null,null,null,null,null,"RT25"]
[7.6179314386170525,26000,null,null,null,null,null,null," RSCA3"]
[8.0574274831526509,27500,null,null,null,null,null,null,null,null,null,null,null,"MT 28",null,null,null,null," RT28"]
[8.6434222092001178,29500,null,"supraSchwank10"]
[8.7899208907119828,30000,null,null,null,null,"   K-30 *","DR 30 / DR 30 (S)",null,"DK30 *","HD3","GG-30","RIHN 30*","MT 30",null,null,4030,null," RT30"]
[9.6689129797831814,33000,null,null,null,null,null,null,null,"  DK33 **",null,null,null,null,null,null,null,"RA-30"]
[9.8154116612950482,33500,null,null,null,null,null,null,null,null,null,null,null,"MT 33",null,null,null,null," RT33"]
[10.254907705830648,35000,"IL 37",null,null,"ecoSchwank 10","   K-35 *",null,null,"DK35 *",null,null,null,null,null,"SHR35",null,"RA-35"]
{"$rows_left_out":44}
{"sheet":"1","index":8,"n_rows":61,"n_cols":7,"rows_kept":61,"cut":false,"hidden":false,"merged":[]}
["BURNER KITS"]
[null,null,null,null,"NG -> LP"]
[null,"QTY","PART #","Description","Conv. Kit"]
["P40U-I",1,{"$f":"\"PU-I040-\"&IF('Tube Htr Kits'!J5=\"USA\",\"AN\",\"CN\")","v":"PU-I040-AN"},"P40U-I Factory Assembled Heater 10' x 40,000 Btuh NG ","JS-0555XA","Type 1 Hose Connector 1/2\" x 36\" INCLUDED with heater","Flexible Gas Connector 1/2\" x 24\" INCLUDED with heater"]
["IQ-45",1,{"$f":"\"JJ-S045\"&IF('1. Project Details'!$C$6=\"USA\",\"-AN\",\"-CN\")","v":"JJ-S045-AN"},"IQ BURNER KIT 45,000 Btuh NG","JS-0556-XC","Type 1 Hose Connector 1/2\" x 36\" INCLUDED in Burner Kit","Flexible Gas Connector 1/2\" x 24\" INCLUDED in Burner Kit"]
["IQ-60",1,{"$f":"\"JJ-S060\"&IF('Tube Htr Kits'!$J$5=\"USA\",\"-AN\",\"-CN\")","v":"JJ-S060-AN"},"IQ BURNER KIT 60,000 Btuh NG","JS-0557-XX","Type 1 Hose Connector 1/2\" x 36\" INCLUDED in Burner Kit","Flexible Gas Connector 1/2\" x 24\" INCLUDED in Burner Kit"]
["IQ-80",1,{"$f":"\"JJ-S080\"&IF('Tube Htr Kits'!$J$5=\"USA\",\"-AN\",\"-CN\")","v":"JJ-S080-AN"},"IQ BURNER KIT 80,000 Btuh NG","JS-0559-XX","Type 1 Hose Connector 1/2\" x 36\" INCLUDED in Burner Kit","Flexible Gas Connector 1/2\" x 24\" INCLUDED in Burner Kit"]
["IQ-100",1,{"$f":"\"JJ-S100\"&IF('Tube Htr Kits'!$J$5=\"USA\",\"-AN\",\"-CN\")","v":"JJ-S100-AN"},"IQ BURNER KIT 100,000 Btuh NG","JS-0561-XA","Type 1 Hose Connector 1/2\" x 36\" INCLUDED in Burner Kit","Flexible Gas Connector 1/2\" x 24\" INCLUDED in Burner Kit"]
["IQ-110",1,{"$f":"\"JJ-S110\"&IF('Tube Htr Kits'!$J$5=\"USA\",\"-AN\",\"-CN\")","v":"JJ-S110-AN"},"IQ BURNER KIT 110,000 Btuh NG","JS-0561-XX","Type 1 Hose Connector 1/2\" x 36\" INCLUDED in Burner Kit","Flexible Gas Connector 1/2\" x 24\" INCLUDED in Burner Kit"]
["IQ-130",1,{"$f":"\"JJ-S130\"&IF('Tube Htr Kits'!$J$5=\"USA\",\"-AN\",\"-CN\")","v":"JJ-S130-AN"},"IQ BURNER KIT 130,000 Btuh NG","JS-0563-XX","Type 1 Hose Connector 1/2\" x 36\" INCLUDED in Burner Kit","Flexible Gas Connector 1/2\" x 24\" INCLUDED in Burner Kit"]
["IQ-155",1,{"$f":"\"JJ-S155\"&IF('Tube Htr Kits'!$J$5=\"USA\",\"-AN\",\"-CN\")","v":"JJ-S155-AN"},"IQ BURNER KIT 155,000 Btuh NG","JS-0565-XX","Type 1 Hose Connector 3/4\" x 36\" INCLUDED in Burner Kit","Flexible Gas Connector 3/4\" x 36\" INCLUDED in Burner Kit"]
["IQ-175",1,{"$f":"\"JJ-S175\"&IF('Tube Htr Kits'!$J$5=\"USA\",\"-AN\",\"-CN\")","v":"JJ-S175-AN"},"IQ BURNER KIT 175,000 Btuh NG","JS-0567-AA","Type 1 Hose Connector 3/4\" x 36\" INCLUDED in Burner Kit","Flexible Gas Connector 3/4\" x 36\" INCLUDED in Burner Kit"]
["IQ-200",1,{"$f":"\"JJ-S200\"&IF('Tube Htr Kits'!$J$5=\"USA\",\"-AN\",\"-CN\")","v":"JJ-S200-AN"},"IQ BURNER KIT 200,000 Btuh NG","JS-0567-CC","Type 1 Hose Connector 3/4\" x 36\" INCLUDED in Burner Kit","Flexible Gas Connector 3/4\" x 36\" INCLUDED in Burner Kit"]
["P40R",1,"PU-R040-BN","P40R Factory Assembled Workshop Heater 10' x 40,000 Btuh NG ","JS-0555XA","Can be connected directly to gas supply piping; Check Local Codes & Requirements","Can be connected directly to gas supply piping; Check Local Codes & Requirements"]
["ITB-45",1,{"$f":"\"JJ-E045\"&IF('Tube Htr Kits'!$J$5=\"USA\",\"-BN\",\"-CN\")","v":"JJ-E045-BN"},"ITB BURNER KIT  45,000 Btuh NG","JS-0556-XE","Type 1 Hose Connector 1/2\" x 36\" INCLUDED in Burner Kit","Flexible Gas Connector 1/2\" x 24\" INCLUDED in Burner Kit"]
{"$rows_left_out":47}
{"sheet":"2","index":9,"n_rows":123,"n_cols":7,"rows_kept":123,"cut":false,"hidden":false,"merged":[]}
["IQ-45-10",1,"TS-4510-JZ","IQ 10' TUBE KIT 45,000 BTU ONLY"]
["IQ-45-20",1,"TS-1420-JZ","IQ 20' TUBE KIT STAND ALONE"]
["IQ-60-20",1,"TS-1420-JZ","IQ 20' TUBE KIT STAND ALONE"]
["IQ-60-30",1,"TS-1430-JZ","IQ 30' TUBE KIT STAND ALONE"]
["IQ-80-20",1,"TS-1420-JZ","IQ 20' TUBE KIT STAND ALONE"]
["IQ-80-30",1,"TS-1430-JZ","IQ 30' TUBE KIT STAND ALONE"]
["IQ-80-40",1,"TS-1040-JZ","IQ 40' TUBE KIT STAND ALONE"]
["IQ-100-20",1,"TS-1020-JZ","IQ TUBE KIT 20' STAND ALONE 100MBH"]
["IQ-110-30",1,"TS-1430-JZ","IQ 30' TUBE KIT STAND ALONE"]
["IQ-110-40",1,"TS-1040-JZ","IQ 40' TUBE KIT STAND ALONE"]
["IQ-110-50",1,"TS-F030-JZ","IQ TUBE KIT 30' PRIMARY 110-155",1,"TS-0020-JZ","IQ - TUBE KIT SECONDARY  20'"]
["IQ-130-30",1,"TS-1430-JZ","IQ 30' TUBE KIT STAND ALONE"]
["IQ-130-40",1,"TS-1040-JZ","IQ 40' TUBE KIT STAND ALONE"]
["IQ-130-50",1,"TS-F030-JZ","IQ TUBE KIT 30' PRIMARY 110-155",1,"TS-0020-JZ","IQ TUBE KIT SECONDARY  20'"]
["IQ-155-40",1,"TS-1040-JZ","IQ 40' TUBE KIT STAND ALONE"]
{"$rows_left_out":108}